Added 10 it unpacker on GPU

3 jobs for devel in 5 minutes and 48 seconds (queued for 2 seconds)
Status Name Job ID Coverage
  Build
passed build_cuda #1258666

00:02:51

 
  Test
failed make_doc #1258668

00:01:09

passed run_tests #1258667

00:02:56

 
Name Stage Failure
failed
make_doc Test
make[3]: *** [CMakeFiles/doc] Error 2
CMakeFiles/doc.dir/build.make:57: recipe for target 'CMakeFiles/doc' failed
CMakeFiles/Makefile2:67: recipe for target 'CMakeFiles/doc.dir/all' failed
make[2]: *** [CMakeFiles/doc.dir/all] Error 2
CMakeFiles/Makefile2:74: recipe for target 'CMakeFiles/doc.dir/rule' failed
make[1]: *** [CMakeFiles/doc.dir/rule] Error 2
Makefile:175: recipe for target 'doc' failed
make: *** [doc] Error 2
ERROR: Job failed: exit code 1