Fix detect accumulate call

3 jobs for spol_fix in 3 minutes and 11 seconds (queued for 3 seconds)
Status Name Job ID Coverage
  Build
failed build_cuda #1384679

00:03:11

 
  Test
skipped make_doc #1384681
skipped run_tests #1384680
 
Name Stage Failure
failed
build_cuda Build

make[2]: *** [psrdada_cpp/effelsberg/edd/test/CMakeFiles/gtest_edd.dir/src/gtest_edd_generated_GatedSpectrometerTest.cu.o] Error 1
psrdada_cpp/effelsberg/edd/test/CMakeFiles/gtest_edd.dir/build.make:84: recipe for target 'psrdada_cpp/effelsberg/edd/test/CMakeFiles/gtest_edd.dir/src/gtest_edd_generated_GatedSpectrometerTest.cu.o' failed
CMakeFiles/Makefile2:1667: recipe for target 'psrdada_cpp/effelsberg/edd/test/CMakeFiles/gtest_edd.dir/all' failed
make[1]: *** [psrdada_cpp/effelsberg/edd/test/CMakeFiles/gtest_edd.dir/all] Error 2
Makefile:140: recipe for target 'all' failed
make: *** [all] Error 2
Cleaning up file based variables
ERROR: Job failed: exit code 1