Integrated real harmonic RGSpace representation deeply into NIFTy.

4 jobs for real_fft_really_integrated in 6 minutes and 17 seconds (queued for 1 second)
Status Job ID Name Coverage
  Test
failed #246513
test_min

00:02:58

failed #246514
test_mpi

00:04:19

failed #246515
test_mpi_fftw

00:04:50

failed #246516
test_mpi_fftw_hdf5

00:06:16

 
Name Stage Failure
failed
test_mpi_fftw_hdf5 Test There is an unknown failure, please try again
-------------------------------------------------------
--------------------------------------------------------------------------
mpiexec detected that one or more processes exited with non-zero status, thus causing
the job to be terminated. The first process to do so was:

Process name: [[21658,1],0]
Exit code: 1
--------------------------------------------------------------------------
ERROR: Job failed: exit code 1
failed
test_mpi_fftw Test There is an unknown failure, please try again
Arrays are not almost equal to 7 decimals
ACTUAL: (0.52758797327216567+0.92464179112863665j)
DESIRED: (0.37973740482164875+0.51474219375677988j)

----------------------------------------------------------------------
Ran 4092 tests in 55.827s

FAILED (SKIP=5, failures=16)
ERROR: Job failed: exit code 1
failed
test_mpi Test There is an unknown failure, please try again
Arrays are not almost equal to 7 decimals
ACTUAL: (0.52758797327216567+0.92464179112863665j)
DESIRED: (0.37973740482164875+0.51474219375677988j)

----------------------------------------------------------------------
Ran 3084 tests in 49.136s

FAILED (SKIP=1433, failures=16)
ERROR: Job failed: exit code 1
failed
test_min Test There is an unknown failure, please try again
Arrays are not almost equal to 7 decimals
ACTUAL: (0.52758797327216567+0.92464179112863665j)
DESIRED: (0.37973740482164875+0.51474219375677988j)

----------------------------------------------------------------------
Ran 3018 tests in 55.450s

FAILED (SKIP=1483, failures=16)
ERROR: Job failed: exit code 1