more fixes

12 jobs for parametric_kl in 5 minutes and 25 seconds (queued for 2 seconds)
latest
Status Job ID Name Coverage
  Build Docker
passed #1280477
build_docker_from_cache

00:00:14

 
  Test
passed #1280479
test_mpi

00:00:16

failed #1280478
test_serial

00:05:11

 
  Demo Runs
skipped #1280486
run_bernoulli
skipped #1280487
run_curve_fitting
skipped #1280482
run_getting_started_1
skipped #1280483
run_getting_started_2
skipped #1280484
run_getting_started_3
skipped #1280485
run_getting_started_mf
skipped #1280480
run_ipynb0
skipped #1280481
run_ipynb1
skipped #1280488
run_visual_mgvi
 
Name Stage Failure
failed
test_serial Test
TOTAL                                           7839   1390    82%

=========================== short test summary info ============================
FAILED test/test_sugar.py::test_calc_pos[False-False] - ModuleNotFoundError: ...
FAILED test/test_sugar.py::test_calc_pos[False-True] - ModuleNotFoundError: N...
FAILED test/test_sugar.py::test_calc_pos[True-False] - ModuleNotFoundError: N...
FAILED test/test_sugar.py::test_calc_pos[True-True] - ModuleNotFoundError: No...
FAILED test/test_operators/test_simplification.py::test_modify_sample_domain
5 failed, 3778 passed, 145 skipped, 2 warnings in 298.78s (0:04:58)