Tweak docstrings

12 jobs for fft_interpolator in 6 minutes and 17 seconds (queued for 2 seconds)
latest
Status Job ID Name Coverage
  Build Docker
passed #1272845
build_docker_from_cache

00:00:14

 
  Test
passed #1272847
test_mpi

00:00:16

failed #1272846
test_serial

00:06:02

 
  Demo Runs
skipped #1272854
run_bernoulli
skipped #1272855
run_curve_fitting
skipped #1272850
run_getting_started_1
skipped #1272851
run_getting_started_2
skipped #1272852
run_getting_started_3
skipped #1272853
run_getting_started_mf
skipped #1272848
run_ipynb0
skipped #1272849
run_ipynb1
skipped #1272856
run_visual_mgvi
 
Name Stage Failure
failed
test_serial Test
FAILED test/test_operators/test_interpolators.py::test_fourier_interpolation[10.0-180.0-1.0-37]
FAILED test/test_operators/test_interpolators.py::test_fourier_interpolation[10.0-180.0-1.0-100]
FAILED test/test_operators/test_interpolators.py::test_fourier_interpolation[10.0-180.0-4.23-37]
FAILED test/test_operators/test_interpolators.py::test_fourier_interpolation[10.0-180.0-4.23-100]
FAILED test/test_operators/test_interpolators.py::test_fourier_interpolation[10.0-31.2-1.0-37]
FAILED test/test_operators/test_interpolators.py::test_fourier_interpolation[10.0-31.2-1.0-100]
FAILED test/test_operators/test_interpolators.py::test_fourier_interpolation[10.0-31.2-4.23-37]
FAILED test/test_operators/test_interpolators.py::test_fourier_interpolation[10.0-31.2-4.23-100]
48 failed, 4044 passed, 145 skipped, 2 warnings in 348.57s (0:05:48)