fix floating point error domain inequality bug

14 jobs for fix_domain_equality_bug in 6 minutes and 19 seconds (queued for 2 seconds)
Status Job ID Name Coverage
  Static Checks
passed #1338728
check_no_asserts

00:00:13

 
  Build Docker
passed #1338729
build_docker_from_cache

00:00:14

 
  Test
passed #1338731
test_mpi

00:00:26

failed #1338730
test_serial

00:05:51

 
  Demo Runs
skipped #1338739
run_bernoulli
skipped #1338740
run_curve_fitting
skipped #1338738
run_getting_density
skipped #1338734
run_getting_started_1
skipped #1338735
run_getting_started_2
skipped #1338736
run_getting_started_3
skipped #1338737
run_getting_started_mf
skipped #1338732
run_ipynb0
skipped #1338733
run_ipynb1
skipped #1338741
run_visual_vi
 
Name Stage Failure
failed
test_serial Test
FAILED test/test_spaces/test_power_space.py::test_rhopindexConsistency[harmonic_partner34-None-4-True]
FAILED test/test_spaces/test_power_space.py::test_rhopindexConsistency[harmonic_partner35-None-4-False]
FAILED test/test_spaces/test_power_space.py::test_rhopindexConsistency[harmonic_partner36-None-None-True]
FAILED test/test_spaces/test_power_space.py::test_rhopindexConsistency[harmonic_partner37-None-None-False]
FAILED test/test_spaces/test_power_space.py::test_rhopindexConsistency[harmonic_partner38-None-3-True]
FAILED test/test_spaces/test_power_space.py::test_rhopindexConsistency[harmonic_partner39-None-3-False]
FAILED test/test_spaces/test_power_space.py::test_rhopindexConsistency[harmonic_partner40-None-4-True]
FAILED test/test_spaces/test_power_space.py::test_rhopindexConsistency[harmonic_partner41-None-4-False]
120 failed, 4122 passed, 293 skipped, 4 warnings in 339.04s (0:05:39)